{"text_format":"1","workbook":"xlsx","n_sheets":5,"sheets":["入力シート","Sheet2","Sheet1","演習1（JPC）","演習2（CRC）"],"not_rendered":{"charts":13,"images":1,"macros":1,"external_links":0,"defined_names":3,"comments":3,"pivot_tables":0},"unopened":[],"bounds":{"document_bytes":16777216,"sheet_cells":100000,"rows_first":2000,"rows_last":500,"rows_between":2000,"halvings":0,"cell_chars":16384,"cell_head_chars":4096},"cells_cut":0,"cells_raw":0,"read":"whole","date_system":"1900"}

{"sheet":"入力シート","index":0,"n_rows":134,"n_cols":68,"rows_kept":134,"cut":false,"hidden":false,"merged":[[7,2,8,2],[7,1,8,1],[38,41,38,65],[27,24,28,24],[27,27,28,27],[38,16,38,40],[7,12,7,13],[8,12,8,13],[14,12,14,13],[24,32,24,33],[26,32,26,33],[38,15,39,15],[38,6,38,7],[118,5,119,11],[15,12,15,13],[9,12,9,13],[10,12,10,13],[11,12,11,13],[12,12,12,13],[13,12,13,13],[16,12,16,13]]}
[]
[null,{"$f":"IF(G4=1,\"CRC版疲労計算(入力画面)\",\"JPC版疲労計算(入力画面)\")","v":"JPC版疲労計算(入力画面)"},null,null,null,null,null,null,{"$f":"IF(G4=1,\"[W=\"&G8&\"mm]\",\"[W=\"&G8&\"mm,L=\"&G9&\"mm]\")","v":"[W=4000mm,L=5000mm]"},null,null,null,"※白色セルにデータ入力してください。【入力方法は、手入力またはコピー・貼り付けでお願いします。切り取り、移動はNGです。】"]
[]
[null,null,null,null,null,"コンクリート版の種類",2,null,"設計期間",10,"年"]
[null,null,null,null,null,null," 1 ：CRC版",null,"破壊確率",37,"％     "]
[null,null,null,null,null,null," 2 ：JPC版",null,null,null,null,null,"走行位置頻度（左輪）",null,null,null,null,"左輪走行位置  (自由縁部からの走行位置)"]
[null,null,null,null,null,"コンクリート版の寸法",null,null,"疲労曲線",1,null,null,null,null,null,null,null,null,1,2,3,4,5,6,7,8,9,10,11,12,13,14,15,16,17,18,19,20,21,22,23,24,25]
[null,"着目点","疲労度","応力比１を",null,"幅員方向",4000,"mm",null," 1 ：舗装示方書2014",null,null,"車線幅員(計算上の車線幅）",null,{"$f":"O9-W24+W30","v":3700},"mm",null,"走行位置(mm)",500,600,700,800,900,1000,1100,1200,1300,1400,1500,1600,1700,1800,1900]
[null,null,null,"超えた箇所数",null,{"$f":"IF(G4=1,\"走行方向(入力なし)\",\"走行方向\")","v":"走行方向"},5000,"mm←JPCの場合は目地間隔",null,null,null,null,"コンクリート版の幅",null,{"$f":"G8","v":4000},"mm"]
[1,500,3.3483924455002374E-2,"OK",null,null,null,null,null,null,null,null,"路肩の幅",null,1750,"mm"]
[2,600,4.9450012148224913E-2,"OK",null,"コンクリート版厚",290,"mm",null,null,null,null,"走行中心位置（中央線から）",null,{"$f":"0.65*O8-460","v":1945},"mm"]
[3,700,6.7343058576223372E-2,"OK",null,null,null,null,null,null,null,null,"外側線からの走行中心位置",null,{"$f":"O8-O11","v":1755},"mm"]
[4,800,8.9900191700827442E-2,"OK",null,"コンクリート版幅",{"$f":"IF(G4=1,G8,G9)","v":5000},"mm",null,null,null,null,"自由縁部からの走行中心位置",null,{"$f":"O12+(O9-O8)","v":2055},"mm      修正値",null,"右輪走行位置  (自由縁部からの走行位置)"]
[5,900,0.11500030261149723,"OK",null,"（そり拘束係数選定用）",null,null,null,null,null,null,"自由縁から左車輪走行最頻位置",null,{"$f":"O9-O11-O16/2","v":1155},1200,"mm",null,26,27,28,29,30,31,32,33,34,35,36,37,38,39,40,41,42,43,44,45,46,47,48,49,50]
[6,1000,0.13872270378045162,"OK",null,null,null,null,null,null,null,null,"標準偏差",null,{"$f":"O10*0.04+230","v":300},"mm",null,"走行位置(mm)",{"$f":"IF(S8=\"\",NA(),S8+$O16)","v":2300},2400,2500,2600,2700,2800,2900,3000,3100,3200,3300,3400,{"$f":"IF(AE8=\"\",NA(),AE8+$O16)","v":3500},3600,3700,{"$error":"#N/A"},{"$error":"#N/A"},{"$error":"#N/A"},{"$error":"#N/A"},{"$error":"#N/A"},{"$error":"#N/A"},{"$error":"#N/A"},{"$error":"#N/A"},{"$error":"#N/A"},{"$error":"#N/A"}]
[7,1100,0.15588719849131927,"OK",null,"温度差の発生頻度",1,null,null,null,null,null,"トレッド",null,1800,"mm"]
[8,1200,0.16176282975874809,"OK",null,null,"1：温度差の大きいところ",null,null,null,null,null,"側帯の幅",null,500,"mm"]
[9,1300,0.15495471831655622,"OK",null,null,"2：温度差の小さいところ"]
[10,1400,0.13573233646110305,"OK",null,null,null,null,null,null,null,null,"荷重および頻度（輪数）"]
[11,1500,0.10851297818580689,"OK",null,"ヤング係数　E",30000,"MPa"]
[12,1600,7.91525164666015E-2,"OK",null,"ポアソン比　ν",0.2,null,null,null,null,null,"荷重 F (KN)","1日頻度（輪数）","設計輪数",null,null,null,null,null,null,"路肩",null,null,null,null,"車線幅員(計算上の車線幅）",{"$f":"O8","v":3700},null,null,null,"中央線"]
[13,1700,5.2933431473268039E-2,"OK",null,"設計基準曲げ強度fbk",4.5,"MPa",null,null,null,null,9.8000000000000007,9998,{"$f":"$J$4*365*N22","v":36492700},null,null,null,{"$f":"IF(G4=1,\"CRC版\",\"NC版\")","v":"NC版"},null,null,{"$f":"O10","v":1750},null,null,null,null,"車線幅員",{"$f":"AB21-W30","v":3500}]
[14,1800,3.2846471473900116E-2,"OK",null,"設計曲げ強度 fbd,h",{"$f":"0.43*(1+7.04/G11^(1/3))*G22","v":3.9930422955855698},"MPa",null,null,null,null,19.600000000000001,2418,{"$f":"$J$4*365*N23","v":8825700},null,null,null,null,null,null,null,"側帯"]
[15,1900,1.834617548539199E-2,"OK",null,"寸法効果式",1,null,null,null,null,null,29.4,1802,6577300,null,null,null,null,null,null,{"$f":"V22-W24","v":1250},{"$f":"O17","v":500},"車輪走行最頻位置",null,null,null,null,"走行中心位置",{"$f":"O11","v":1945},null,null,"頻度合計"]
[16,null,0,"OK",null,null," 1 ：舗装示方書2014",null,null,null,null,null,39.200000000000003,980,3577000,null,{"$f":"IF(G4=1,\"***\",G9)","v":5000},null,"NC版応力計算位置",null,null,null,null,{"$f":"P14","v":1200},null,"トレッド",{"$f":"O16","v":1800},null,null,null,null,null,{"$f":"BO66","v":1.0000000093132257}]
[17,null,0,"OK",null,null,null,null,null,null,null,null,49,505,1843250,null,"mm",null,null,null,null,null,null,null,null,null,null,null,null,{"$f":"AA34-AE26","v":3850},150,null,"頻度％合計"]
[18,null,0,"OK",null,null,null,null,null,null,null,null,58.8,329,1200850,null,null,null,null,null,null,null,null,null,null,null,null,null,null,null,null,null,{"$f":"AG25*100","v":100.00000093132257}]
[19,null,0,"OK",null,"応力低減係数",1,"←CRCPは0.65",null,null,null,null,68.599999999999994,182,664300,null,null,null,null,null,null,null,null,null,"左輪",null,null,"右輪"]
[20,null,0,"OK",null,"係数C",2.12,null,null,null,null,null,78.400000000000006,81,295650,null,null,null,"左輪走行位置",null,null,null,{"$f":"W24-W30","v":300}]
[21,null,0,"OK",null,"熱膨張率　α",1.0000000000000001E-5,"1/℃",null,null,null,null,88.2,36,131400,null,null,null,"タイヤ：幅300mm×長さ233mm",null,null,null,200]
[22,null,0,"OK",null,"路盤反力係数　k",0.1,"GPa/m",null,null,null,null,98,19,69350,null,null,null,"CRC版応力計算位置"]
[23,null,0,"OK",null,"剛比半径 ℓ",{"$f":"(G20*G11^3/12/(1-G21^2)/G31)^0.25","v":892.72087928552537},"mm",null,null,null,null,117.6,0,0,null,null,null,null,null,null,"自由縁部"]
[24,null,0,"OK",null,"タイヤ接地圧　ｐ",0.7,"MPa",null,null,null,null,137.19999999999999,0,0,null,null,null,"幅員方向",null,null,null,null,null,null,null,"コンクリート版の幅"]
[25,null,0,"OK",null,"荷重応力計算法",1,null,null,null,null,null,156.80000000000001,0,0,null,null,null,{"$f":"G8","v":4000},"mm",null,null,null,null,null,null,{"$f":"O9","v":4000}]
[]
[null,null,null,null,null,null,null,null,null,null,null,null,"温度差正、負での頻度（率）"]
[null,null,null,null,null,"温度応力比　　（基準応力に対する比率）",null,null,null,null,null,null,null,null,null,null," 着目点の各走行位置における荷重応力比　（基準応力に対する応力比）"]
[null,null,null,null,null,"　　　入力点数は、２０点以上５０点以下",null,null,null,null,null,null,"温度差正",0.6,null,null,null,1,2,3,4,5,6,7,8,9,10,11,12,13,14,15,16,17,18,19,20,21,22,23,24,25,26,27,28,29,30,31,32,33,34,35,36,37,38,39,40,41,42,43,44,45,46,47,48,49,50]
[null,null,null,null,null,null,"温度応力比",null,null,null,null,null,"温度差負",{"$f":"1-N38","v":0.4},null,"着目点(mm)　　　　　入力","左輪走行位置(mm)",null,null,null,null,null,null,null,null,null,null,null,null,null,null,null,null,null,null,null,null,null,null,null,null,"右輪走行位置(mm)"]
[null,null,null,null,null,"位置(mm)","温度差正","温度差負",null,null,null,null,null,null,null,null,{"$f":"IF(S8=\"\",\"\",S8)","v":500},600,700,800,900,1000,1100,1200,1300,1400,{"$f":"IF(AC8=\"\",\"\",AC8)","v":1500},{"$f":"IF(AD8=\"\",\"\",AD8)","v":1600},{"$f":"IF(AE8=\"\",\"\",AE8)","v":1700},{"$f":"IF(AF8=\"\",\"\",AF8)","v":1800},1900,"","","","","","","","","","",{"$f":"IFERROR(S15,\"\")","v":2300},2400,2500,2600,2700,2800,2900,3000,3100,3200,3300,3400,3500,3600,3700,"","","","","","","","","",""]
[null,null,null,null,1,0,1,1,null,null,null,null,null,null,1,500,0.64025760981833657,0.59828057597666928,0.49426453612005589,0.40062579743605325,0.33242602831277718,0.28012029892460055,0.23830123336776235,0.2039127529011483,0.17532656905036759,0.1512121028008992,0.13061546874050672,0.11322680600279483,9.8201591834254823E-2,8.5454766389209555E-2,7.4475970593596202E-2,null,null,null,null,null,null,null,null,null,null,4.5059238106810867E-2,4.0581444802235862E-2,3.6945743969864518E-2,3.3969256941490979E-2,3.1582720699921019E-2,2.9837171152560911E-2,2.8406950604532476E-2,2.7428762379245398E-2,2.6710614253599857E-2,2.5811410170727262E-2,2.5119387569111126E-2,2.3652105231180508E-2,2.2025031897442128E-2,2.0040707211859774E-2,1.7395953581627075E-2]
[null,null,null,null,2,100,0.99933399933399925,1,null,null,null,null,null,null,2,600,0.57972537821252812,0.61552949753934016,0.57696700893128383,0.47633513579196796,0.38540616076310835,0.31964274864815606,0.26928732000729083,0.22898718026611581,0.19608117139558906,0.16864937116471232,0.14542195759159124,0.1259067987119509,0.10913178200376694,9.4878182149583809E-2,8.2641715778601382E-2,null,null,null,null,null,null,null,null,null,null,4.9578953763898169E-2,4.4424327115863665E-2,4.021082690321405E-2,3.6735524636976734E-2,3.3931587581262537E-2,3.1849444073151469E-2,3.0179840816574523E-2,2.9021811774712924E-2,2.8157239200437455E-2,2.7154748162099764E-2,2.6370374870891305E-2,2.4833221945440187E-2,2.3179415517346133E-2,2.1094841727930011E-2,1.8428215565951759E-2]
[null,null,null,null,3,200,1.0009990009990009,1.0028288543140027,null,null,null,null,null,null,3,700,0.46934807703991738,0.55974846588492622,0.59803754784616325,0.56217874718998728,0.4636733701925998,0.3747372258338903,0.31055349656722769,0.26142535998541833,0.22234643660003647,0.19037001032869555,0.16366729448933715,0.14138769062518988,0.12234643660003645,0.10623367154748163,9.2411446624946852E-2,null,null,null,null,null,null,null,null,null,null,5.492618020535877E-2,4.8983534844158211E-2,4.4081049881523796E-2,4.0015189258156635E-2,3.6698462847074551E-2,3.4200741235798048E-2,3.2212163557931835E-2,3.0828725925025825E-2,2.9790388237438483E-2,2.8661522571237621E-2,2.7765963910322621E-2,2.6151041983109545E-2,2.4438301233367765E-2,2.228081900479981E-2,1.9548575247584909E-2]
[null,null,null,null,4,300,1.0036630036630036,1.007072135785007,null,null,null,null,null,null,4,800,0.37995625493650892,0.45318063065799874,0.54536727626222736,0.585831459991494,0.55168600765538622,0.45480284342912697,0.36716689956862508,0.30393705571419893,0.25579925876420195,0.21750410109970228,0.18610486663831341,0.16022237073941309,0.13829515766449968,0.11985539826234887,0.10408894829576525,null,null,null,null,null,null,null,null,null,null,6.1261315997326697E-2,5.4383012333677629E-2,4.8672458837110397E-2,4.3896956072665409E-2,3.9976912327601921E-2,3.6974299775198984E-2,3.4578042408408775E-2,3.2892642323348931E-2,3.1645300443526342E-2,3.0365757336411694E-2,2.9344431617959781E-2,2.7640196852785709E-2,2.5836928124430406E-2,2.3601676894100494E-2,2.0831156206330883E-2]
[null,null,null,null,5,400,1.0073260073260073,1.0134370579915133,null,null,null,null,null,null,5,900,0.31464244486299292,0.36689956862506834,0.44138161492192718,0.53531198736253727,0.57714320432590072,0.54430402819126322,0.44850841484901877,0.36160763108329791,0.29918585576280454,0.25167385624886079,0.21385867914211074,0.18316422625918952,0.15756121271037124,0.1361625858193086,0.11798408165745186,null,null,null,null,null,null,null,null,null,null,6.8740506713652116E-2,6.077525973631448E-2,5.410292241326934E-2,4.8508414849018772E-2,4.3864147275047088E-2,4.0258824958989005E-2,3.7361929643356218E-2,3.527674828361383E-2,3.376086031958199E-2,3.2293577981651375E-2,3.1120967251959415E-2,2.9301294124794947E-2,2.7411142839783707E-2,2.5058022966158337E-2,2.2218239261194483E-2]
[null,null,null,null,6,500,1.0113220113220112,1.0205091937765203,null,null,null,null,null,null,6,1000,0.26424448629928915,0.30404034266966401,0.35716629199829886,0.43312473418798225,0.5281244304028192,0.57100674403062157,0.53910322619843254,0.4439030317759281,0.35761589403973515,0.29574093201288054,0.24857524758490795,0.21136764080442311,0.18088583753569476,0.15573850173157544,0.134546448751443,null,null,null,null,null,null,null,null,null,null,7.7550276444498453E-2,6.8309131782003776E-2,6.0511574214715362E-2,5.3960750956923272E-2,4.8473175770095397E-2,4.415456589100189E-2,4.0648885108451306E-2,3.806671122182393E-2,3.6188711343337995E-2,3.4489944711100312E-2,3.3135062883528771E-2,3.1171395589039436E-2,2.9160945379427667E-2,2.6706968831642267E-2,2.3794276687526584E-2]
[null,null,null,null,7,600,1.0153180153180152,1.0325318246110324,null,null,null,null,null,null,7,1100,0.22413876906251901,0.25568382040221155,0.29607509569232643,0.3503918828604411,0.42718269639710793,0.52303906677197887,0.56674160034023935,0.535281608846224,0.44054316787168118,0.3547420863965004,0.2930980010936266,0.24650950847560604,0.20943556716689959,0.17936691172003158,0.1543836199040039,null,null,null,null,null,null,null,null,null,null,8.7951880430159793E-2,7.7167507138951347E-2,6.8072179354760315E-2,6.0399781274682547E-2,5.3927942159304944E-2,4.8768454948660313E-2,4.4540373048180329E-2,4.1356704538550344E-2,3.9006014946230023E-2,3.6999210158575858E-2,3.542499544322255E-2,3.3288170605747618E-2,3.114709277598882E-2,2.8551552342183609E-2,2.5520991554772467E-2]
[null,null,null,null,8,700,1.0186480186480187,1.0445544554455444,null,null,null,null,null,null,8,1200,0.19151224254207425,0.21717601312351906,0.24912206087854671,0.29048544869068593,0.34548271462421776,0.42297830973935235,0.51954553739595355,0.56356400753387204,0.53249893675192905,0.43816756789598399,0.35251230329910693,0.29139072847682124,0.24485084148490191,0.20816574518500516,0.17818822528707698,null,null,null,null,null,null,null,null,null,null,0.10017011969135427,8.7593413937663289E-2,7.6979160337809105E-2,6.7993195212345828E-2,6.0370010328695552E-2,5.4231727322437577E-2,4.9157907527796342E-2,4.5244547056321777E-2,4.2313020232091866E-2,3.9883346497357065E-2,3.8032079713226807E-2,3.5693541527431802E-2,3.339084999088645E-2,3.0634303420620939E-2,2.7493164833829516E-2]
[null,null,null,null,9,800,1.0219780219780221,1.0586987270155588,null,null,null,null,null,null,9,1300,0.16461510419831096,0.18583753569475667,0.21173825870344493,0.24451060210219336,0.28645118172428458,0.3420134880612431,0.42011665350264299,0.51692083358648766,0.5612795431071147,0.53048787897199101,0.43629625129108696,0.35111489154869674,0.28999939242967376,0.24383619904003892,0.20718755695971808,null,null,null,null,null,null,null,null,null,null,0.11459991494015434,9.9890637341272251E-2,8.744759705935963E-2,7.6924479008445235E-2,6.7968892399295225E-2,6.067804848411204E-2,5.4618142049942288E-2,4.9849322559086216E-2,4.6211191445409812E-2,4.3234096846710007E-2,4.1016465155841793E-2,3.8430038276930562E-2,3.5941430220548028E-2,3.3012941247949457E-2,2.9715657087307858E-2]
[null,null,null,null,10,900,1.0249750249750249,1.0714285714285714,null,null,null,null,null,null,10,1400,0.14230512181785043,0.16002187253174555,0.18134151528039372,0.20795309557081235,0.24112643538489581,0.28358344978431255,0.33967434230512183,0.41795977884440122,0.51506774409137857,0.55962695181967315,0.52893249893675198,0.43512364056139496,0.34995443222553013,0.28916094537942771,0.24300382769305548,null,null,null,null,null,null,null,null,null,null,0.13164833829515768,0.11434473540312293,9.9775198979281859E-2,8.7423294246309013E-2,7.6924479008445235E-2,6.8278753265690509E-2,6.1072969196184462E-2,5.5299835956011914E-2,5.0819004799805577E-2,4.7163254146667478E-2,4.4448629928914275E-2,4.1554164894586548E-2,3.8834072543896959E-2,3.5699617230694453E-2,3.2229175527067264E-2]
[null,null,null,null,11,1000,1.0276390276390275,1.0834512022630833,null,null,null,null,null,null,11,1500,0.12367701561455739,0.13855641290479373,0.15626101221216354,0.17818214958381431,0.20510359074062823,0.23876298681572394,0.28164530044352637,0.3379123883589526,0.41641047451242486,0.51370071085728175,0.55832675132146548,0.52800899204082874,0.43416367944589584,0.34928610486663836,0.28847439091074795,null,null,null,null,null,null,null,null,null,null,0.1519168843793669,0.13144784008749014,0.11429005407375904,9.9793426089069825E-2,8.7435445652834329E-2,7.7240415578103169E-2,6.8685825384288232E-2,6.1753447961601558E-2,5.6269518196731275E-2,5.179658545476639E-2,4.8441582113129593E-2,4.5130323834983901E-2,4.2130141563886024E-2,3.8762986815723918E-2,3.5097515037365579E-2]
[null,null,null,null,12,1100,1.0299700299700301,1.0961810466760962,null,null,null,null,null,null,12,1600,0.10805638252627743,0.12058448265386719,0.13537274439516375,0.15360592988638436,0.17575794398201591,0.20312291147700348,0.23717115256090893,0.28019928306701503,0.33660611215748221,0.41531684792514734,0.51260708427000423,0.55758551552342184,0.5272252263199465,0.43367154748162101,0.34873321586973699,null,null,null,null,null,null,null,null,null,null,0.176158940397351,0.15175284039127529,0.13143568868096484,0.11435081110638556,9.9823804605383079E-2,8.7793912145330819E-2,7.7659639103226194E-2,6.9354152743180034E-2,6.2713409077100685E-2,5.7264110820827517E-2,5.3124734187982262E-2,4.9249650647062396E-2,4.5903153289993316E-2,4.2249225347834013E-2,3.8360775259736316E-2]
[null,null,null,null,13,1200,1.0319680319680318,1.1082036775106081,null,null,null,null,null,null,13,1700,9.4945014885472995E-2,0.10551673856248861,0.1178504161856735,0.1331065070781943,0.15152196366729451,0.17409320128804912,0.20181663527553317,0.23596816331490372,0.27911780788626284,0.33573728659092295,0.41444194665532541,0.51203596816331487,0.55695971808736866,0.52685460842092469,0.43320371833039678,null,null,null,null,null,null,null,null,null,null,0.20552888996901394,0.17603742633209796,0.15179537031411386,0.13156327844948054,0.11439334102922415,0.10018834680114223,8.8225287076979172E-2,7.8327966462117996E-2,7.032018956194179E-2,6.3728051521963675E-2,5.8642687891123396E-2,5.4046418372926675E-2,5.0228446442675739E-2,4.6244607813354398E-2,4.2078498086153472E-2]
[null,null,null,null,14,1300,1.0339660339660339,1.1188118811881187,null,null,null,null,null,null,14,1800,8.3911537760495786E-2,9.2824594446807226E-2,0.10312291147700346,0.115900115438362,0.1312837960993985,0.15009417340057113,0.17301172610729693,0.20078376572088219,0.23509326204508174,0.27842517771432046,0.3350385807157179,0.4139862689106264,0.51153776049577737,0.55670453855033719,0.52648399052190287,null,null,null,null,null,null,null,null,null,null,0.24172793000789841,0.20549243574943801,0.17618324321040163,0.1519715657087308,0.13164226259189502,0.11481864025760984,0.10066832735889179,8.8905765842396248E-2,7.9300078984142416E-2,7.1377361929643363E-2,6.5161917491949689E-2,5.9676772586426882E-2,5.5215383680661041E-2,5.0825080503068235E-2,4.6330275229357801E-2]
[null,null,null,null,15,1400,1.0356310356310356,1.1280056577086277,null,null,null,null,null,null,15,1900,7.4615711768637225E-2,8.2131356704538555E-2,9.0704174008141444E-2,0.10141563886019808,0.11425967555744579,0.13003827693055472,0.14917066650464791,0.17211859772768698,0.20005468132936388,0.23452822164165504,0.27787228871741904,0.33466796281669609,0.41360957530834197,0.51138586791421115,0.55643113190351789,null,null,null,null,null,null,null,null,null,null,0.28756303542135003,0.24174615711768641,0.20567470684731759,0.17639589282459445,0.15212345829029711,0.13211616744638194,0.11535937784798592,0.10139133604714747,8.9920408287259251E-2,8.041800838447051E-2,7.2871984932255912E-2,6.631022540859105E-2,6.1030439273345893E-2,5.6093930372440613E-2,5.1220001215140656E-2]
[null,null,null,null,16,1500,1.0369630369630369,1.1357850070721358,null,null,null,null,null,null,16]
[null,null,null,null,17,1600,1.037962037962038,1.1428571428571428,null,null,null,null,null,null,17]
[null,null,null,null,18,1700,1.0386280386280384,1.1478076379066477,null,null,null,null,null,null,18]
[null,null,null,null,19,1800,1.0392940392940393,1.1506364922206505,null,null,null,null,null,null,19]
[null,null,null,null,20,1900,1.0396270396270395,1.1541725601131541,null,null,null,null,null,null,20]
[null,null,null,null,21,2000,1.0396270396270395,1.1548797736916547,null,null,null,null,null,null,21]
[null,null,null,null,22,2100,1.0392940392940393,1.1548797736916547,null,null,null,null,null,null,22]
[null,null,null,null,23,2200,1.0389610389610386,1.1527581329561527,null,null,null,null,null,null,23]
[null,null,null,null,24,2300,1.0382950382950382,1.14992927864215,null,null,null,null,null,null,24]
[null,null,null,null,25,2400,1.0372960372960371,1.144978783592645,null,null,null,null,null,null,25]
[null,null,null,null,26,2500,1.0359640359640359,1.1386138613861387,null,null,null,null,null,null,null,null,9.0326536446809769E-3,1.8475824967026711E-2,3.3851105719804764E-2,5.5555261671543121E-2,8.1670172512531281E-2,0.10754479467868805,0.1268540620803833,0.1340322345495224,0.12685409188270569,0.10754479467868805,8.1670165061950684E-2,5.5555261671543121E-2,3.3851105719804764E-2,1.8475810065865517E-2,9.0326704084873199E-3,0,0,0,0,0,0,0,0,0,0,9.0326536446809769E-3,1.8475824967026711E-2,3.3851105719804764E-2,5.5555261671543121E-2,8.1670172512531281E-2,0.10754479467868805,0.1268540620803833,0.1340322345495224,0.12685409188270569,0.10754479467868805,8.1670165061950684E-2,5.5555261671543121E-2,3.3851105719804764E-2,1.8475810065865517E-2,9.0326704084873199E-3,0,0,0,0,0,0,0,0,0,0,{"$f":"SUM(AP66:BN66)","v":1.0000000093132257}]
[null,null,null,null,27,2600,1.0346320346320346,1.13012729844413]
[null,null,null,null,28,2700,1.0329670329670328,1.1209335219236209]
[null,null,null,null,29,2800,1.0313020313020311,1.1117397454031117]
[null,null,null,null,30,2900,1.0289710289710288,1.1004243281471005]
[null,null,null,null,31,3000,1.0266400266400266,1.0884016973125883]
[null,null,null,null,32,3100,1.0239760239760238,1.077086280056577]
[null,null,null,null,33,3200,1.0209790209790208,1.0629420084865628]
[null,null,null,null,34,3300,1.0179820179820178,1.0509193776520507]
[null,null,null,null,35,3400,1.0143190143190144,1.0374823196605374]
[null,null,null,null,36,3500,1.0106560106560107,1.0254596888260252]
[null,null,null,null,37,3600,1.0066600066600067,1.0183875530410182]
[null,null,null,null,38,3700,1.0026640026640026,1.0106082036775104]
[null,null,null,null,39,3800,1,1.0056577086280056]
[null,null,null,null,40,3900,0.99866799866799849,1.0028288543140027]
[null,null,null,null,41,4000,0.99933399933399925,1.0007072135785007]
[null,null,null,null,42]
[null,null,null,null,43]
[null,null,null,null,44]
[null,null,null,null,45]
[null,null,null,null,46]
[null,null,null,null,47]
[null,null,null,null,48]
[null,null,null,null,49]
[null,null,null,null,50]
[]
[]
[]
[null,null,null,null,null,null,null,null,null,null,null,null,null,null,null,null,null,null,null,null,null,null,null,null,null,null,null,null,null,null,null,null,null,null,null,null,null,null,null,null,null,null,null,null,null,null,null,null,null,null,null,null,null,null,null,null,0,0,0,0,0,0,0,0,0,0,0,5.8041693409904838E-4]
[]
[null,null,null,null,null,null,null,null,null,null,null,null,null,null,null,null,null,null,null,null,null,null,null,null,null,null,null,null,null,null,null,null,null,null,null,null,null,null,null,null,null,null,null,null,null,null,null,null,null,null,null,null,null,null,null,null,null,1.5864291926845908E-3]
[]
[]
[]
[null,null,null,null,null,"コンクリート版の温度差と発生頻度（率）"]
[]
[null,null,null,null,null,"(温度差の大きいところ)",null,null,null,null,null,null,"(温度差の小さいところ)"]
[null,null,null,null,null,"温度差",150,200,230,250,280,300,"温度差",150,200,230,250,280,300,290]
[null,null,null,null,null,19,0,0,2E-3,5.0000000000000001E-3,0.01,1.2E-2,{"$f":"F104","v":19},0,0,0,0,0,0,1.0999999940395355E-2]
[null,null,null,null,null,17,0,5.0000000000000001E-3,1.4999999999999999E-2,1.7999999999999999E-2,1.7999999999999999E-2,0.02,{"$f":"F105","v":17},0,0,0,0,0,0,1.8999999389052391E-2]
[null,null,null,null,null,15,5.0000000000000001E-3,0.02,2.8000000000000001E-2,3.2000000000000001E-2,3.6999999999999998E-2,3.7999999999999999E-2,15,0,0,1E-3,2E-3,4.0000000000000001E-3,7.0000000000000001E-3,3.7500001490116119E-2]
[null,null,null,null,null,13,1.4999999999999999E-2,0.04,0.04,0.04,0.04,0.04,13,5.0000000000000001E-3,7.0000000000000001E-3,1.2E-2,1.6E-2,2.1000000000000001E-2,2.5000000000000001E-2,3.9999999105930328E-2]
[null,null,null,null,null,11,0.04,0.06,0.05,0.05,4.4999999999999998E-2,4.4999999999999998E-2,11,0.02,2.8000000000000001E-2,3.2000000000000001E-2,3.6999999999999998E-2,4.4999999999999998E-2,5.2999999999999999E-2,4.5000001788139343E-2]
[null,null,null,null,null,9,7.0000000000000007E-2,7.0000000000000007E-2,7.4999999999999997E-2,0.08,0.08,0.08,9,0.05,0.06,7.4999999999999997E-2,8.5000000000000006E-2,0.08,0.08,7.9999998211860657E-2]
[null,null,null,null,null,7,0.1,0.1,0.1,0.1,0.1,0.105,7,0.1,0.11,0.11,0.11,0.11,0.115,0.10249999910593033]
[null,null,null,null,null,5,0.12,0.12,0.125,0.125,0.125,0.125,5,0.13500000000000001,0.14000000000000001,0.15,0.155,0.15,0.14000000000000001,0.125]
[null,null,null,null,null,3,0.2,0.19500000000000001,0.19,0.19,0.19,0.185,3,0.19,0.19500000000000001,0.2,0.20499999999999999,0.21,0.21,0.1875]
[null,null,null,null,null,1,0.45,0.39,0.375,0.36,0.35499999999999998,0.35,1,0.5,0.46,0.42,0.39,0.38,0.37,0.35249999165534973]
[null,null,null,null,null,-1,0.51,0.45,0.42,0.41,0.4,0.39,-1,0.65,0.61499999999999999,0.61,0.6,0.53,0.48,0]
[null,null,null,null,null,-3,0.34,0.33,0.33,0.32,0.32,0.32,-3,0.35,0.36,0.34499999999999997,0.33500000000000002,0.36,0.38,0]
[null,null,null,null,null,-5,0.15,0.2,0.22,0.22,0.22500000000000001,0.23,-5,0,2.5000000000000001E-2,4.3999999999999997E-2,6.3E-2,0.1,0.12,0]
[null,null,null,null,null,-7,0,0.02,0.03,4.8000000000000001E-2,5.1999999999999998E-2,5.5E-2,-7,0,0,1E-3,2E-3,0.01,0.02,0]
[null,null,null,null,null,-9,0,0,0,2E-3,3.0000000000000001E-3,5.0000000000000001E-3,-9,0,0,0,0,0,0,0]
[null,null,null,null,null,null,null,null,null,null,null,null,null,null,null,null,null,null,null,{"$f":"SUM(T104:T118)","v":0.99999999068677425}]
[]
[]
[]
[null,null,null,null,null,"温度差正",{"$f":"N38","v":0.6}]
[null,null,null,null,null,"温度差負",{"$f":"N39","v":0.4}]
[]
[null,null,null,null,null,"コンクリート版幅  (ｍ)","正の場合","負の場合"]
[null,null,null,null,null,5,0.85,0.4]
[null,null,null,null,null,6,0.91,0.55000000000000004]
[null,null,null,null,null,7.5,0.95,0.73]
[null,null,null,null,null,8,0.95,0.78]
[null,null,null,null,null,10,0.96,0.9]
[null,null,null,null,null,12.5,0.97,0.93]
[null,null,null,null,null,15,0.98,0.95]
[null,null,null,null,null,null,0.85610002279281616,0.39500001072883606]

{"sheet":"Sheet2","index":1,"n_rows":0,"n_cols":0,"rows_kept":0,"cut":false,"hidden":false,"merged":[]}

{"sheet":"Sheet1","index":2,"n_rows":4,"n_cols":12,"rows_kept":4,"cut":false,"hidden":false,"merged":[]}
[]
[]
[null,null,null,"設計年数",3,9,19,34,54,85,100,135]
[null,null,null,"破壊確率",10,20,30,40,50,60,64,70]

{"sheet":"演習1（JPC）","index":3,"n_rows":134,"n_cols":68,"rows_kept":134,"cut":false,"hidden":false,"merged":[[16,12,16,13],[7,1,8,1],[7,2,8,2],[7,12,7,13],[8,12,8,13],[9,12,9,13],[10,12,10,13],[11,12,11,13],[12,12,12,13],[13,12,13,13],[14,12,14,13],[15,12,15,13],[38,41,38,65],[118,5,119,11],[24,32,24,33],[26,32,26,33],[27,24,28,24],[27,27,28,27],[38,6,38,7],[38,15,39,15],[38,16,38,40]]}
[]
[null,{"$f":"IF(G4=1,\"CRC版疲労計算(入力画面)\",\"JPC版疲労計算(入力画面)\")","v":"JPC版疲労計算(入力画面)"},null,null,null,null,null,null,{"$f":"IF(G4=1,\"[W=\"&G8&\"mm]\",\"[W=\"&G8&\"mm,L=\"&G9&\"mm]\")","v":"[W=mm,L=mm]"},null,null,null,"※白色セルにデータ入力してください。【入力方法は、手入力またはコピー・貼り付けでお願いします。切り取り、移動はNGです。】"]
[]
[null,null,null,null,null,"コンクリート版の種類",null,null,"設計期間",null,"年"]
[null,null,null,null,null,null," 1 ：CRC版",null,"破壊確率",null,"％     "]
[null,null,null,null,null,null," 2 ：JPC版",null,null,null,null,null,"走行位置頻度（左輪）",null,null,null,null,"左輪走行位置  (自由縁部からの走行位置)"]
[null,null,null,null,null,"コンクリート版の寸法",null,null,"疲労曲線",1,null,null,null,null,null,null,null,null,1,2,3,4,5,6,7,8,9,10,11,12,13,14,15,16,17,18,19,20,21,22,23,24,25]
[null,"着目点","疲労度","応力比１を",null,"幅員方向",null,"mm",null," 1 ：舗装示方書2014",null,null,"車線幅員(計算上の車線幅）",null,{"$f":"O9-W24+W30","v":200},"mm",null,"走行位置(mm)"]
[null,null,null,"超えた箇所数",null,{"$f":"IF(G4=1,\"走行方向(入力なし)\",\"走行方向\")","v":"走行方向"},null,"mm",null,null,null,null,"コンクリート版の幅",null,{"$f":"G8","v":0},"mm"]
[1,400,5.2608655690965227E-2,"OK",null,null,null,null,null,null,null,null,"路肩の幅",null,null,"mm"]
[2,500,0.11667793712233471,"OK",null,"コンクリート版厚",null,"mm",null,null,null,null,"走行中心位置（中央線から）",null,{"$f":"0.65*O8-460","v":-330},"mm"]
[3,600,0.17881579395911862,"OK",null,null,null,null,null,null,null,null,"外側線からの走行中心位置",null,{"$f":"O8-O11","v":530},"mm"]
[4,700,0.24832444870633422,"OK",null,"コンクリート版幅",{"$f":"IF(G4=1,G8,G9)","v":0},"mm",null,null,null,null,"自由縁部からの走行中心位置",null,{"$f":"O12+(O9-O8)","v":330},"mm      修正値",null,"右輪走行位置  (自由縁部からの走行位置)"]
[5,800,0.33446630960130969,"OK",null,"（そり拘束係数選定用）",null,null,null,null,null,null,"自由縁から左車輪走行最頻位置",null,{"$f":"O9-O11-O16/2","v":-570},null,"mm",null,26,27,28,29,30,31,32,33,34,35,36,37,38,39,40,41,42,43,44,45,46,47,48,49,50]
[6,900,0.42792567301525036,"OK",null,null,null,null,null,null,null,null,"標準偏差",null,{"$f":"O10*0.04+230","v":230},"mm",null,"走行位置(mm)",{"$f":"IF(S8=\"\",NA(),S8+$O16)","v":{"$error":"#N/A"}},{"$error":"#N/A"},{"$error":"#N/A"},{"$error":"#N/A"},{"$error":"#N/A"},{"$error":"#N/A"},{"$error":"#N/A"},{"$error":"#N/A"},{"$error":"#N/A"},{"$error":"#N/A"},{"$error":"#N/A"},{"$error":"#N/A"},{"$error":"#N/A"},{"$error":"#N/A"},{"$error":"#N/A"},{"$error":"#N/A"},{"$error":"#N/A"},{"$error":"#N/A"},{"$error":"#N/A"},{"$error":"#N/A"},{"$error":"#N/A"},{"$error":"#N/A"},{"$error":"#N/A"},{"$error":"#N/A"},{"$error":"#N/A"}]
[7,1000,0.51635266789226042,"OK",null,"温度差の発生頻度",null,null,null,null,null,null,"トレッド",null,1800,"mm"]
[8,1100,0.58044146617665471,"OK",null,null,"1：温度差の大きいところ",null,null,null,null,null,"側帯の幅",null,null,"mm"]
[9,1200,0.60205143360826074,"OK",null,null,"2：温度差の小さいところ"]
[10,1300,0.57575996102677285,"OK",null,null,null,null,null,null,null,null,"荷重および頻度（輪数）"]
[11,1400,0.50247962432466098,"OK",null,"ヤング係数　E",null,"MPa"]
[12,1500,0.39883995587702675,"OK",null,"ポアソン比　ν",null,null,null,null,null,null,"荷重 F (KN)","1日頻度（輪数）","設計輪数",null,null,null,null,null,null,"路肩",null,null,null,null,"車線幅員(計算上の車線幅）",{"$f":"O8","v":200},null,null,null,"中央線"]
[13,1600,0.28746529034199186,"OK",null,"設計基準曲げ強度fbk",null,"MPa",null,null,null,null,9.8000000000000007,9998,{"$f":"$J$4*365*N22","v":0},null,null,null,{"$f":"IF(G4=1,\"CRC版\",\"NC版\")","v":"NC版"},null,null,{"$f":"O10","v":0},null,null,null,null,"車線幅員",{"$f":"AB21-W30","v":0}]
[14,1700,0.18843699083955606,"OK",null,"設計曲げ強度 fbd,h",{"$f":"0.43*(1+7.04/G11^(1/3))*G22","v":{"$error":"#DIV/0!"}},"MPa",null,null,null,null,19.600000000000001,2418,{"$f":"$J$4*365*N23","v":0},null,null,null,null,null,null,null,"側帯"]
[15,1800,0.11314620482601259,"OK",null,"寸法効果式",1,null,null,null,null,null,29.4,1802,0,null,null,null,null,null,null,{"$f":"V22-W24","v":0},{"$f":"O17","v":0},"車輪走行最頻位置",null,null,null,null,"走行中心位置",{"$f":"O11","v":-330},null,null,"頻度合計"]
[16,1900,5.8764246527786043E-2,"OK",null,null," 1 ：舗装示方書2014",null,null,null,null,null,39.200000000000003,980,0,null,{"$f":"IF(G4=1,\"***\",G9)","v":0},null,"NC版応力計算位置",null,null,null,null,{"$f":"P14","v":0},null,"トレッド",{"$f":"O16","v":1800},null,null,null,null,null,{"$f":"BO66","v":1.0000000093132257}]
[17,2000,2.379583066037138E-2,"OK",null,null,null,null,null,null,null,null,49,505,0,null,"mm",null,null,null,null,null,null,null,null,null,null,null,null,{"$f":"AA34-AE26","v":-150},150,null,"頻度％合計"]
[18,null,0,"OK",null,null,null,null,null,null,null,null,58.8,329,0,null,null,null,null,null,null,null,null,null,null,null,null,null,null,null,null,null,{"$f":"AG25*100","v":100.00000093132257}]
[19,null,0,"OK",null,"応力低減係数",null,null,null,null,null,null,68.599999999999994,182,0,null,null,null,null,null,null,null,null,null,"左輪",null,null,"右輪"]
[20,null,0,"OK",null,"係数C",null,null,null,null,null,null,78.400000000000006,81,0,null,null,null,"左輪走行位置",null,null,null,{"$f":"W24-W30","v":-200}]
[21,null,0,"OK",null,"熱膨張率　α",1.0000000000000001E-5,"1/℃",null,null,null,null,88.2,36,0,null,null,null,"タイヤ：幅300mm×長さ233mm",null,null,null,200]
[22,null,0,"OK",null,"路盤反力係数　k",null,"GPa/m",null,null,null,null,98,19,0,null,null,null,"CRC版応力計算位置"]
[23,null,0,"OK",null,"剛比半径 ℓ",{"$f":"(G20*G11^3/12/(1-G21^2)/G31)^0.25","v":{"$error":"#DIV/0!"}},"mm",null,null,null,null,117.6,0,0,null,null,null,null,null,null,"自由縁部"]
[24,null,0,"OK",null,"タイヤ接地圧　ｐ",0.7,"MPa",null,null,null,null,137.19999999999999,0,0,null,null,null,"幅員方向",null,null,null,null,null,null,null,"コンクリート版の幅"]
[25,null,0,"OK",null,"荷重応力計算法",1,null,null,null,null,null,156.80000000000001,0,0,null,null,null,{"$f":"G8","v":0},"mm",null,null,null,null,null,null,{"$f":"O9","v":0}]
[]
[null,null,null,null,null,null,null,null,null,null,null,null,"温度差正、負での頻度（率）"]
[null,null,null,null,null,"温度応力比　　（基準応力に対する比率）",null,null,null,null,null,null,null,null,null,null," 着目点の各走行位置における荷重応力比　（基準応力に対する応力比）"]
[null,null,null,null,null,"　　　入力点数は、２０点以上５０点以下",null,null,null,null,null,null,"温度差正",0.6,null,null,null,1,2,3,4,5,6,7,8,9,10,11,12,13,14,15,16,17,18,19,20,21,22,23,24,25,26,27,28,29,30,31,32,33,34,35,36,37,38,39,40,41,42,43,44,45,46,47,48,49,50]
[null,null,null,null,null,null,"温度応力比",null,null,null,null,null,"温度差負",{"$f":"1-N38","v":0.4},null,"着目点(mm)　　　　　入力","左輪走行位置(mm)",null,null,null,null,null,null,null,null,null,null,null,null,null,null,null,null,null,null,null,null,null,null,null,null,"右輪走行位置(mm)"]
[null,null,null,null,null,"位置(mm)","温度差正","温度差負",null,null,null,null,null,null,null,null,{"$f":"IF(S8=\"\",\"\",S8)","v":""},"","","","","","","","","",{"$f":"IF(AC8=\"\",\"\",AC8)","v":""},{"$f":"IF(AD8=\"\",\"\",AD8)","v":""},{"$f":"IF(AE8=\"\",\"\",AE8)","v":""},{"$f":"IF(AF8=\"\",\"\",AF8)","v":""},"","","","","","","","","","","",{"$f":"IFERROR(S15,\"\")","v":""},"","","","","","","","","","","","","","","","","","","","","","","",""]
[null,null,null,null,1,null,null,null,null,null,null,null,null,null,1]
[null,null,null,null,2,null,null,null,null,null,null,null,null,null,2]
[null,null,null,null,3,null,null,null,null,null,null,null,null,null,3]
[null,null,null,null,4,null,null,null,null,null,null,null,null,null,4]
[null,null,null,null,5,null,null,null,null,null,null,null,null,null,5]
[null,null,null,null,6,null,null,null,null,null,null,null,null,null,6]
[null,null,null,null,7,null,null,null,null,null,null,null,null,null,7]
[null,null,null,null,8,null,null,null,null,null,null,null,null,null,8]
[null,null,null,null,9,null,null,null,null,null,null,null,null,null,9]
[null,null,null,null,10,null,null,null,null,null,null,null,null,null,10]
[null,null,null,null,11,null,null,null,null,null,null,null,null,null,11]
[null,null,null,null,12,null,null,null,null,null,null,null,null,null,12]
[null,null,null,null,13,null,null,null,null,null,null,null,null,null,13]
[null,null,null,null,14,null,null,null,null,null,null,null,null,null,14]
[null,null,null,null,15,null,null,null,null,null,null,null,null,null,15]
[null,null,null,null,16,null,null,null,null,null,null,null,null,null,16]
[null,null,null,null,17,null,null,null,null,null,null,null,null,null,17]
[null,null,null,null,18,null,null,null,null,null,null,null,null,null,18]
[null,null,null,null,19,null,null,null,null,null,null,null,null,null,19]
[null,null,null,null,20,null,null,null,null,null,null,null,null,null,20]
[null,null,null,null,21,null,null,null,null,null,null,null,null,null,21]
[null,null,null,null,22,null,null,null,null,null,null,null,null,null,22]
[null,null,null,null,23,null,null,null,null,null,null,null,null,null,23]
[null,null,null,null,24,null,null,null,null,null,null,null,null,null,24]
[null,null,null,null,25,null,null,null,null,null,null,null,null,null,25]
[null,null,null,null,26,null,null,null,null,null,null,null,null,null,null,null,9.0326536446809769E-3,1.8475824967026711E-2,3.3851105719804764E-2,5.5555261671543121E-2,8.1670172512531281E-2,0.10754479467868805,0.1268540620803833,0.1340322345495224,0.12685409188270569,0.10754479467868805,8.1670165061950684E-2,5.5555261671543121E-2,3.3851105719804764E-2,1.8475810065865517E-2,9.0326704084873199E-3,0,0,0,0,0,0,0,0,0,0,9.0326536446809769E-3,1.8475824967026711E-2,3.3851105719804764E-2,5.5555261671543121E-2,8.1670172512531281E-2,0.10754479467868805,0.1268540620803833,0.1340322345495224,0.12685409188270569,0.10754479467868805,8.1670165061950684E-2,5.5555261671543121E-2,3.3851105719804764E-2,1.8475810065865517E-2,9.0326704084873199E-3,0,0,0,0,0,0,0,0,0,0,{"$f":"SUM(AP66:BN66)","v":1.0000000093132257}]
[null,null,null,null,27]
[null,null,null,null,28]
[null,null,null,null,29]
[null,null,null,null,30]
[null,null,null,null,31]
[null,null,null,null,32]
[null,null,null,null,33]
[null,null,null,null,34]
[null,null,null,null,35]
[null,null,null,null,36]
[null,null,null,null,37]
[null,null,null,null,38]
[null,null,null,null,39]
[null,null,null,null,40]
[null,null,null,null,41]
[null,null,null,null,42]
[null,null,null,null,43]
[null,null,null,null,44]
[null,null,null,null,45]
[null,null,null,null,46]
[null,null,null,null,47]
[null,null,null,null,48]
[null,null,null,null,49]
[null,null,null,null,50]
[]
[]
[]
[null,null,null,null,null,null,null,null,null,null,null,null,null,null,null,null,null,null,null,null,null,null,null,null,null,null,null,null,null,null,null,null,null,null,null,null,null,null,null,null,null,null,null,null,null,null,null,null,null,null,null,null,null,null,null,null,0,0,0,0,0,0,0,0,0,0,0,5.8041693409904838E-4]
[]
[null,null,null,null,null,null,null,null,null,null,null,null,null,null,null,null,null,null,null,null,null,null,null,null,null,null,null,null,null,null,null,null,null,null,null,null,null,null,null,null,null,null,null,null,null,null,null,null,null,null,null,null,null,null,null,null,null,1.5864291926845908E-3]
[]
[]
[]
[null,null,null,null,null,"コンクリート版の温度差と発生頻度（率）"]
[]
[null,null,null,null,null,"(温度差の大きいところ)",null,null,null,null,null,null,"(温度差の小さいところ)"]
[null,null,null,null,null,"温度差",150,200,230,250,280,300,"温度差",150,200,230,250,280,300,280]
[null,null,null,null,null,19,0,0,2E-3,5.0000000000000001E-3,0.01,1.2E-2,{"$f":"F104","v":19},0,0,0,0,0,0,6.0000000521540642E-3]
[null,null,null,null,null,17,0,5.0000000000000001E-3,1.4999999999999999E-2,1.7999999999999999E-2,1.7999999999999999E-2,0.02,{"$f":"F105","v":17},0,0,0,0,0,0,1.080000028014183E-2]
[null,null,null,null,null,15,5.0000000000000001E-3,0.02,2.8000000000000001E-2,3.2000000000000001E-2,3.6999999999999998E-2,3.7999999999999999E-2,15,0,0,1E-3,2E-3,4.0000000000000001E-3,7.0000000000000001E-3,2.2200001403689384E-2]
[null,null,null,null,null,13,1.4999999999999999E-2,0.04,0.04,0.04,0.04,0.04,13,5.0000000000000001E-3,7.0000000000000001E-3,1.2E-2,1.6E-2,2.1000000000000001E-2,2.5000000000000001E-2,2.4000000208616257E-2]
[null,null,null,null,null,11,0.04,0.06,0.05,0.05,4.4999999999999998E-2,4.4999999999999998E-2,11,0.02,2.8000000000000001E-2,3.2000000000000001E-2,3.6999999999999998E-2,4.4999999999999998E-2,5.2999999999999999E-2,2.7000002562999725E-2]
[null,null,null,null,null,9,7.0000000000000007E-2,7.0000000000000007E-2,7.4999999999999997E-2,0.08,0.08,0.08,9,0.05,0.06,7.4999999999999997E-2,8.5000000000000006E-2,0.08,0.08,4.8000000417232513E-2]
[null,null,null,null,null,7,0.1,0.1,0.1,0.1,0.1,0.105,7,0.1,0.11,0.11,0.11,0.11,0.115,6.0000002384185791E-2]
[null,null,null,null,null,5,0.12,0.12,0.125,0.125,0.125,0.125,5,0.13500000000000001,0.14000000000000001,0.15,0.155,0.15,0.14000000000000001,7.5000002980232239E-2]
[null,null,null,null,null,3,0.2,0.19500000000000001,0.19,0.19,0.19,0.185,3,0.19,0.19500000000000001,0.2,0.20499999999999999,0.21,0.21,0.11400000005960464]
[null,null,null,null,null,1,0.45,0.39,0.375,0.36,0.35499999999999998,0.35,1,0.5,0.46,0.42,0.39,0.38,0.37,0.21299999952316284]
[null,null,null,null,null,-1,0.51,0.45,0.42,0.41,0.4,0.39,-1,0.65,0.61499999999999999,0.61,0.6,0.53,0.48,0.15999999642372131]
[null,null,null,null,null,-3,0.34,0.33,0.33,0.32,0.32,0.32,-3,0.35,0.36,0.34499999999999997,0.33500000000000002,0.36,0.38,0.12799999117851257]
[null,null,null,null,null,-5,0.15,0.2,0.22,0.22,0.22500000000000001,0.23,-5,0,2.5000000000000001E-2,4.3999999999999997E-2,6.3E-2,0.1,0.12,8.9999988675117493E-2]
[null,null,null,null,null,-7,0,0.02,0.03,4.8000000000000001E-2,5.1999999999999998E-2,5.5E-2,-7,0,0,1E-3,2E-3,0.01,0.02,2.0800000056624413E-2]
[null,null,null,null,null,-9,0,0,0,2E-3,3.0000000000000001E-3,5.0000000000000001E-3,-9,0,0,0,0,0,0,1.1999999405816197E-3]
[]
[]
[]
[]
[null,null,null,null,null,"温度差正",{"$f":"N38","v":0.6}]
[null,null,null,null,null,"温度差負",{"$f":"N39","v":0.4}]
[]
[null,null,null,null,null,"コンクリート版幅  (ｍ)","正の場合","負の場合"]
[null,null,null,null,null,5,0.85,0.4]
[null,null,null,null,null,6,0.91,0.55000000000000004]
[null,null,null,null,null,7.5,0.95,0.73]
[null,null,null,null,null,8,0.95,0.78]
[null,null,null,null,null,10,0.96,0.9]
[null,null,null,null,null,12.5,0.97,0.93]
[null,null,null,null,null,15,0.98,0.95]
[null,null,null,null,null,null,0.95999997854232788,0.89999997615814209]

{"sheet":"演習2（CRC）","index":4,"n_rows":134,"n_cols":68,"rows_kept":134,"cut":false,"hidden":false,"merged":[[16,12,16,13],[7,1,8,1],[7,2,8,2],[7,12,7,13],[8,12,8,13],[9,12,9,13],[10,12,10,13],[11,12,11,13],[12,12,12,13],[13,12,13,13],[14,12,14,13],[15,12,15,13],[38,41,38,65],[118,5,119,11],[24,32,24,33],[26,32,26,33],[27,24,28,24],[27,27,28,27],[38,6,38,7],[38,15,39,15],[38,16,38,40]]}
[]
[null,{"$f":"IF(G4=1,\"CRC版疲労計算(入力画面)\",\"JPC版疲労計算(入力画面)\")","v":"JPC版疲労計算(入力画面)"},null,null,null,null,null,null,{"$f":"IF(G4=1,\"[W=\"&G8&\"mm]\",\"[W=\"&G8&\"mm,L=\"&G9&\"mm]\")","v":"[W=mm,L=mm]"},null,null,null,"※白色セルにデータ入力してください。【入力方法は、手入力またはコピー・貼り付けでお願いします。切り取り、移動はNGです。】"]
[]
[null,null,null,null,null,"コンクリート版の種類",null,null,"設計期間",null,"年"]
[null,null,null,null,null,null," 1 ：CRC版",null,"破壊確率",null,"％     "]
[null,null,null,null,null,null," 2 ：JPC版",null,null,null,null,null,"走行位置頻度（左輪）",null,null,null,null,"左輪走行位置  (自由縁部からの走行位置)"]
[null,null,null,null,null,"コンクリート版の寸法",null,null,"疲労曲線",1,null,null,null,null,null,null,null,null,1,2,3,4,5,6,7,8,9,10,11,12,13,14,15,16,17,18,19,20,21,22,23,24,25]
[null,"着目点","疲労度","応力比１を",null,"幅員方向",null,"mm",null," 1 ：舗装示方書2014",null,null,"車線幅員(計算上の車線幅）",null,{"$f":"O9-W24+W30","v":200},"mm",null,"走行位置(mm)"]
[null,null,null,"超えた箇所数",null,{"$f":"IF(G4=1,\"走行方向(入力なし)\",\"走行方向\")","v":"走行方向"},null,"mm",null,null,null,null,"コンクリート版の幅",null,{"$f":"G8","v":0},"mm"]
[1,400,5.2608655690965227E-2,"OK",null,null,null,null,null,null,null,null,"路肩の幅",null,null,"mm"]
[2,500,0.11667793712233471,"OK",null,"コンクリート版厚",null,"mm",null,null,null,null,"走行中心位置（中央線から）",null,{"$f":"0.65*O8-460","v":-330},"mm"]
[3,600,0.17881579395911862,"OK",null,null,null,null,null,null,null,null,"外側線からの走行中心位置",null,{"$f":"O8-O11","v":530},"mm"]
[4,700,0.24832444870633422,"OK",null,"コンクリート版幅",{"$f":"IF(G4=1,G8,G9)","v":0},"mm",null,null,null,null,"自由縁部からの走行中心位置",null,{"$f":"O12+(O9-O8)","v":330},"mm      修正値",null,"右輪走行位置  (自由縁部からの走行位置)"]
[5,800,0.33446630960130969,"OK",null,"（そり拘束係数選定用）",null,null,null,null,null,null,"自由縁から左車輪走行最頻位置",null,{"$f":"O9-O11-O16/2","v":-570},null,"mm",null,26,27,28,29,30,31,32,33,34,35,36,37,38,39,40,41,42,43,44,45,46,47,48,49,50]
[6,900,0.42792567301525036,"OK",null,null,null,null,null,null,null,null,"標準偏差",null,{"$f":"O10*0.04+230","v":230},"mm",null,"走行位置(mm)",{"$f":"IF(S8=\"\",NA(),S8+$O16)","v":{"$error":"#N/A"}},{"$error":"#N/A"},{"$error":"#N/A"},{"$error":"#N/A"},{"$error":"#N/A"},{"$error":"#N/A"},{"$error":"#N/A"},{"$error":"#N/A"},{"$error":"#N/A"},{"$error":"#N/A"},{"$error":"#N/A"},{"$error":"#N/A"},{"$error":"#N/A"},{"$error":"#N/A"},{"$error":"#N/A"},{"$error":"#N/A"},{"$error":"#N/A"},{"$error":"#N/A"},{"$error":"#N/A"},{"$error":"#N/A"},{"$error":"#N/A"},{"$error":"#N/A"},{"$error":"#N/A"},{"$error":"#N/A"},{"$error":"#N/A"}]
[7,1000,0.51635266789226042,"OK",null,"温度差の発生頻度",null,null,null,null,null,null,"トレッド",null,1800,"mm"]
[8,1100,0.58044146617665471,"OK",null,null,"1：温度差の大きいところ",null,null,null,null,null,"側帯の幅",null,null,"mm"]
[9,1200,0.60205143360826074,"OK",null,null,"2：温度差の小さいところ"]
[10,1300,0.57575996102677285,"OK",null,null,null,null,null,null,null,null,"荷重および頻度（輪数）"]
[11,1400,0.50247962432466098,"OK",null,"ヤング係数　E",null,"MPa"]
[12,1500,0.39883995587702675,"OK",null,"ポアソン比　ν",null,null,null,null,null,null,"荷重 F (KN)","1日頻度（輪数）","設計輪数",null,null,null,null,null,null,"路肩",null,null,null,null,"車線幅員(計算上の車線幅）",{"$f":"O8","v":200},null,null,null,"中央線"]
[13,1600,0.28746529034199186,"OK",null,"設計基準曲げ強度fbk",null,"MPa",null,null,null,null,9.8000000000000007,9998,{"$f":"$J$4*365*N22","v":0},null,null,null,{"$f":"IF(G4=1,\"CRC版\",\"NC版\")","v":"NC版"},null,null,{"$f":"O10","v":0},null,null,null,null,"車線幅員",{"$f":"AB21-W30","v":0}]
[14,1700,0.18843699083955606,"OK",null,"設計曲げ強度 fbd,h",{"$f":"0.43*(1+7.04/G11^(1/3))*G22","v":{"$error":"#DIV/0!"}},"MPa",null,null,null,null,19.600000000000001,2418,{"$f":"$J$4*365*N23","v":0},null,null,null,null,null,null,null,"側帯"]
[15,1800,0.11314620482601259,"OK",null,"寸法効果式",1,null,null,null,null,null,29.4,1802,0,null,null,null,null,null,null,{"$f":"V22-W24","v":0},{"$f":"O17","v":0},"車輪走行最頻位置",null,null,null,null,"走行中心位置",{"$f":"O11","v":-330},null,null,"頻度合計"]
[16,1900,5.8764246527786043E-2,"OK",null,null," 1 ：舗装示方書2014",null,null,null,null,null,39.200000000000003,980,0,null,{"$f":"IF(G4=1,\"***\",G9)","v":0},null,"NC版応力計算位置",null,null,null,null,{"$f":"P14","v":0},null,"トレッド",{"$f":"O16","v":1800},null,null,null,null,null,{"$f":"BO66","v":1.0000000093132257}]
[17,2000,2.379583066037138E-2,"OK",null,null,null,null,null,null,null,null,49,505,0,null,"mm",null,null,null,null,null,null,null,null,null,null,null,null,{"$f":"AA34-AE26","v":-150},150,null,"頻度％合計"]
[18,null,0,"OK",null,null,null,null,null,null,null,null,58.8,329,0,null,null,null,null,null,null,null,null,null,null,null,null,null,null,null,null,null,{"$f":"AG25*100","v":100.00000093132257}]
[19,null,0,"OK",null,"応力低減係数",null,null,null,null,null,null,68.599999999999994,182,0,null,null,null,null,null,null,null,null,null,"左輪",null,null,"右輪"]
[20,null,0,"OK",null,"係数C",null,null,null,null,null,null,78.400000000000006,81,0,null,null,null,"左輪走行位置",null,null,null,{"$f":"W24-W30","v":-200}]
[21,null,0,"OK",null,"熱膨張率　α",null,"1/℃",null,null,null,null,88.2,36,0,null,null,null,"タイヤ：幅300mm×長さ233mm",null,null,null,200]
[22,null,0,"OK",null,"路盤反力係数　k",0.1,"GPa/m",null,null,null,null,98,19,0,null,null,null,"CRC版応力計算位置"]
[23,null,0,"OK",null,"剛比半径 ℓ",{"$f":"(G20*G11^3/12/(1-G21^2)/G31)^0.25","v":0},"mm",null,null,null,null,117.6,0,0,null,null,null,null,null,null,"自由縁部"]
[24,null,0,"OK",null,"タイヤ接地圧　ｐ",0.7,"MPa",null,null,null,null,137.19999999999999,0,0,null,null,null,"幅員方向",null,null,null,null,null,null,null,"コンクリート版の幅"]
[25,null,0,"OK",null,"荷重応力計算法",1,null,null,null,null,null,156.80000000000001,0,0,null,null,null,{"$f":"G8","v":0},"mm",null,null,null,null,null,null,{"$f":"O9","v":0}]
[]
[null,null,null,null,null,null,null,null,null,null,null,null,"温度差正、負での頻度（率）"]
[null,null,null,null,null,"温度応力比　　（基準応力に対する比率）",null,null,null,null,null,null,null,null,null,null," 着目点の各走行位置における荷重応力比　（基準応力に対する応力比）"]
[null,null,null,null,null,"　　　入力点数は、２０点以上５０点以下",null,null,null,null,null,null,"温度差正",null,null,null,null,1,2,3,4,5,6,7,8,9,10,11,12,13,14,15,16,17,18,19,20,21,22,23,24,25,26,27,28,29,30,31,32,33,34,35,36,37,38,39,40,41,42,43,44,45,46,47,48,49,50]
[null,null,null,null,null,null,"温度応力比",null,null,null,null,null,"温度差負",{"$f":"1-N38","v":1},null,"着目点(mm)　　　　　入力","左輪走行位置(mm)",null,null,null,null,null,null,null,null,null,null,null,null,null,null,null,null,null,null,null,null,null,null,null,null,"右輪走行位置(mm)"]
[null,null,null,null,null,"位置(mm)","温度差正","温度差負",null,null,null,null,null,null,null,null,{"$f":"IF(S8=\"\",\"\",S8)","v":""},"","","","","","","","","",{"$f":"IF(AC8=\"\",\"\",AC8)","v":""},{"$f":"IF(AD8=\"\",\"\",AD8)","v":""},{"$f":"IF(AE8=\"\",\"\",AE8)","v":""},{"$f":"IF(AF8=\"\",\"\",AF8)","v":""},"","","","","","","","","","","",{"$f":"IFERROR(S15,\"\")","v":""},"","","","","","","","","","","","","","","","","","","","","","","",""]
[null,null,null,null,1,null,null,null,null,null,null,null,null,null,1]
[null,null,null,null,2,null,null,null,null,null,null,null,null,null,2]
[null,null,null,null,3,null,null,null,null,null,null,null,null,null,3]
[null,null,null,null,4,null,null,null,null,null,null,null,null,null,4]
[null,null,null,null,5,null,null,null,null,null,null,null,null,null,5]
[null,null,null,null,6,null,null,null,null,null,null,null,null,null,6]
[null,null,null,null,7,null,null,null,null,null,null,null,null,null,7]
[null,null,null,null,8,null,null,null,null,null,null,null,null,null,8]
[null,null,null,null,9,null,null,null,null,null,null,null,null,null,9]
[null,null,null,null,10,null,null,null,null,null,null,null,null,null,10]
[null,null,null,null,11,null,null,null,null,null,null,null,null,null,11]
[null,null,null,null,12,null,null,null,null,null,null,null,null,null,12]
[null,null,null,null,13,null,null,null,null,null,null,null,null,null,13]
[null,null,null,null,14,null,null,null,null,null,null,null,null,null,14]
[null,null,null,null,15,null,null,null,null,null,null,null,null,null,15]
[null,null,null,null,16,null,null,null,null,null,null,null,null,null,16]
[null,null,null,null,17,null,null,null,null,null,null,null,null,null,17]
[null,null,null,null,18,null,null,null,null,null,null,null,null,null,18]
[null,null,null,null,19,null,null,null,null,null,null,null,null,null,19]
[null,null,null,null,20,null,null,null,null,null,null,null,null,null,20]
[null,null,null,null,21,null,null,null,null,null,null,null,null,null,21]
[null,null,null,null,22,null,null,null,null,null,null,null,null,null,22]
[null,null,null,null,23,null,null,null,null,null,null,null,null,null,23]
[null,null,null,null,24,null,null,null,null,null,null,null,null,null,24]
[null,null,null,null,25,null,null,null,null,null,null,null,null,null,25]
[null,null,null,null,26,null,null,null,null,null,null,null,null,null,null,null,9.0326536446809769E-3,1.8475824967026711E-2,3.3851105719804764E-2,5.5555261671543121E-2,8.1670172512531281E-2,0.10754479467868805,0.1268540620803833,0.1340322345495224,0.12685409188270569,0.10754479467868805,8.1670165061950684E-2,5.5555261671543121E-2,3.3851105719804764E-2,1.8475810065865517E-2,9.0326704084873199E-3,0,0,0,0,0,0,0,0,0,0,9.0326536446809769E-3,1.8475824967026711E-2,3.3851105719804764E-2,5.5555261671543121E-2,8.1670172512531281E-2,0.10754479467868805,0.1268540620803833,0.1340322345495224,0.12685409188270569,0.10754479467868805,8.1670165061950684E-2,5.5555261671543121E-2,3.3851105719804764E-2,1.8475810065865517E-2,9.0326704084873199E-3,0,0,0,0,0,0,0,0,0,0,{"$f":"SUM(AP66:BN66)","v":1.0000000093132257}]
[null,null,null,null,27]
[null,null,null,null,28]
[null,null,null,null,29]
[null,null,null,null,30]
[null,null,null,null,31]
[null,null,null,null,32]
[null,null,null,null,33]
[null,null,null,null,34]
[null,null,null,null,35]
[null,null,null,null,36]
[null,null,null,null,37]
[null,null,null,null,38]
[null,null,null,null,39]
[null,null,null,null,40]
[null,null,null,null,41]
[null,null,null,null,42]
[null,null,null,null,43]
[null,null,null,null,44]
[null,null,null,null,45]
[null,null,null,null,46]
[null,null,null,null,47]
[null,null,null,null,48]
[null,null,null,null,49]
[null,null,null,null,50]
[]
[]
[]
[null,null,null,null,null,null,null,null,null,null,null,null,null,null,null,null,null,null,null,null,null,null,null,null,null,null,null,null,null,null,null,null,null,null,null,null,null,null,null,null,null,null,null,null,null,null,null,null,null,null,null,null,null,null,null,null,0,0,0,0,0,0,0,0,0,0,0,5.8041693409904838E-4]
[]
[null,null,null,null,null,null,null,null,null,null,null,null,null,null,null,null,null,null,null,null,null,null,null,null,null,null,null,null,null,null,null,null,null,null,null,null,null,null,null,null,null,null,null,null,null,null,null,null,null,null,null,null,null,null,null,null,null,1.5864291926845908E-3]
[]
[]
[]
[null,null,null,null,null,"コンクリート版の温度差と発生頻度（率）"]
[]
[null,null,null,null,null,"(温度差の大きいところ)",null,null,null,null,null,null,"(温度差の小さいところ)"]
[null,null,null,null,null,"温度差",150,200,230,250,280,300,"温度差",150,200,230,250,280,300,280]
[null,null,null,null,null,19,0,0,2E-3,5.0000000000000001E-3,0.01,1.2E-2,{"$f":"F104","v":19},0,0,0,0,0,0,6.0000000521540642E-3]
[null,null,null,null,null,17,0,5.0000000000000001E-3,1.4999999999999999E-2,1.7999999999999999E-2,1.7999999999999999E-2,0.02,{"$f":"F105","v":17},0,0,0,0,0,0,1.080000028014183E-2]
[null,null,null,null,null,15,5.0000000000000001E-3,0.02,2.8000000000000001E-2,3.2000000000000001E-2,3.6999999999999998E-2,3.7999999999999999E-2,15,0,0,1E-3,2E-3,4.0000000000000001E-3,7.0000000000000001E-3,2.2200001403689384E-2]
[null,null,null,null,null,13,1.4999999999999999E-2,0.04,0.04,0.04,0.04,0.04,13,5.0000000000000001E-3,7.0000000000000001E-3,1.2E-2,1.6E-2,2.1000000000000001E-2,2.5000000000000001E-2,2.4000000208616257E-2]
[null,null,null,null,null,11,0.04,0.06,0.05,0.05,4.4999999999999998E-2,4.4999999999999998E-2,11,0.02,2.8000000000000001E-2,3.2000000000000001E-2,3.6999999999999998E-2,4.4999999999999998E-2,5.2999999999999999E-2,2.7000002562999725E-2]
[null,null,null,null,null,9,7.0000000000000007E-2,7.0000000000000007E-2,7.4999999999999997E-2,0.08,0.08,0.08,9,0.05,0.06,7.4999999999999997E-2,8.5000000000000006E-2,0.08,0.08,4.8000000417232513E-2]
[null,null,null,null,null,7,0.1,0.1,0.1,0.1,0.1,0.105,7,0.1,0.11,0.11,0.11,0.11,0.115,6.0000002384185791E-2]
[null,null,null,null,null,5,0.12,0.12,0.125,0.125,0.125,0.125,5,0.13500000000000001,0.14000000000000001,0.15,0.155,0.15,0.14000000000000001,7.5000002980232239E-2]
[null,null,null,null,null,3,0.2,0.19500000000000001,0.19,0.19,0.19,0.185,3,0.19,0.19500000000000001,0.2,0.20499999999999999,0.21,0.21,0.11400000005960464]
[null,null,null,null,null,1,0.45,0.39,0.375,0.36,0.35499999999999998,0.35,1,0.5,0.46,0.42,0.39,0.38,0.37,0.21299999952316284]
[null,null,null,null,null,-1,0.51,0.45,0.42,0.41,0.4,0.39,-1,0.65,0.61499999999999999,0.61,0.6,0.53,0.48,0.15999999642372131]
[null,null,null,null,null,-3,0.34,0.33,0.33,0.32,0.32,0.32,-3,0.35,0.36,0.34499999999999997,0.33500000000000002,0.36,0.38,0.12799999117851257]
[null,null,null,null,null,-5,0.15,0.2,0.22,0.22,0.22500000000000001,0.23,-5,0,2.5000000000000001E-2,4.3999999999999997E-2,6.3E-2,0.1,0.12,8.9999988675117493E-2]
[null,null,null,null,null,-7,0,0.02,0.03,4.8000000000000001E-2,5.1999999999999998E-2,5.5E-2,-7,0,0,1E-3,2E-3,0.01,0.02,2.0800000056624413E-2]
[null,null,null,null,null,-9,0,0,0,2E-3,3.0000000000000001E-3,5.0000000000000001E-3,-9,0,0,0,0,0,0,1.1999999405816197E-3]
[]
[]
[]
[]
[null,null,null,null,null,"温度差正",{"$f":"N38","v":0}]
[null,null,null,null,null,"温度差負",{"$f":"N39","v":1}]
[]
[null,null,null,null,null,"コンクリート版幅  (ｍ)","正の場合","負の場合"]
[null,null,null,null,null,5,0.85,0.4]
[null,null,null,null,null,6,0.91,0.55000000000000004]
[null,null,null,null,null,7.5,0.95,0.73]
[null,null,null,null,null,8,0.95,0.78]
[null,null,null,null,null,10,0.96,0.9]
[null,null,null,null,null,12.5,0.97,0.93]
[null,null,null,null,null,15,0.98,0.95]
[null,null,null,null,null,null,0.95999997854232788,0.89999997615814209]